Windows10 64 位执行 NPM install pug Sass-loader node-Sass --save-dev 命令报错?
1

D:\wamp64\www\web\vue\vuejs-essential>npm install pug sass-loader node-sass --save-dev

node-sass@4.9.0 install D:\wamp64\www\web\vue\vuejs-essential\node_modules\node-sass
node scripts/install.js

Downloading binary from https://github.com/sass/node-sass/releases/download/v4.9.0/win32-x64-57_binding.node
Cannot download "https://github.com/sass/node-sass/releases/download/v4.9.0/win32-x64-57_binding.node":

connect ETIMEDOUT 54.231.114.50:443

Timed out whilst downloading the prebuilt binary

Hint: If github.com is not accessible in your location
try setting a proxy via HTTP_PROXY, e.g.

  export HTTP_PROXY=http://example.com:1234

or configure npm proxy via

  npm config set proxy http://example.com:8080

node-sass@4.9.0 postinstall D:\wamp64\www\web\vue\vuejs-essential\node_modules\node-sass
node scripts/build.js

Building: D:\Program Files\nodejs\node.exe D:\wamp64\www\web\vue\vuejs-essential\node_modules\node-gyp\bin\node-gyp.js rebuild --verbose --libsass_ext= --libsass_cflags= --libsass_ldflags= --libsass_library=
gyp info it worked if it ends with ok
gyp verb cli [ 'D:\Program Files\nodejs\node.exe',
gyp verb cli 'D:\wamp64\www\web\vue\vuejs-essential\node_modules\node-gyp\bin\node-gyp.js',
gyp verb cli 'rebuild',
gyp verb cli '--verbose',
gyp verb cli '--libsass_ext=',
gyp verb cli '--libsass_cflags=',
gyp verb cli '--libsass_ldflags=',
gyp verb cli '--libsass_library=' ]
gyp info using node-gyp@3.7.0
gyp info using node@8.11.2 | win32 | x64
gyp verb command rebuild []
gyp verb command clean []
gyp verb clean removing "build" directory
gyp verb command configure []
gyp verb check python checking for Python executable "python2" in the PATH
gyp verb which failed Error: not found: python2
gyp verb which failed at getNotFoundError (D:\wamp64\www\web\vue\vuejs-essential\node_modules\which\which.js:13:12)
gyp verb which failed at F (D:\wamp64\www\web\vue\vuejs-essential\node_modules\which\which.js:68:19)
gyp verb which failed at E (D:\wamp64\www\web\vue\vuejs-essential\node_modules\which\which.js:80:29)
gyp verb which failed at D:\wamp64\www\web\vue\vuejs-essential\node_modules\which\which.js:89:16
gyp verb which failed at D:\wamp64\www\web\vue\vuejs-essential\node_modules\isexe\index.js:42:5
gyp verb which failed at D:\wamp64\www\web\vue\vuejs-essential\node_modules\isexe\windows.js:36:5
gyp verb which failed at FSReqWrap.oncomplete (fs.js:152:21)
gyp verb which failed python2 { Error: not found: python2
gyp verb which failed at getNotFoundError (D:\wamp64\www\web\vue\vuejs-essential\node_modules\which\which.js:13:12)
gyp verb which failed at F (D:\wamp64\www\web\vue\vuejs-essential\node_modules\which\which.js:68:19)
gyp verb which failed at E (D:\wamp64\www\web\vue\vuejs-essential\node_modules\which\which.js:80:29)
gyp verb which failed at D:\wamp64\www\web\vue\vuejs-essential\node_modules\which\which.js:89:16
gyp verb which failed at D:\wamp64\www\web\vue\vuejs-essential\node_modules\isexe\index.js:42:5
gyp verb which failed at D:\wamp64\www\web\vue\vuejs-essential\node_modules\isexe\windows.js:36:5
gyp verb which failed at FSReqWrap.oncomplete (fs.js:152:21)
gyp verb which failed stack: 'Error: not found: python2\n at getNotFoundError (D:\wamp64\www\web\vue\vuejs-essential\node_modules\which\which.js:13:12)\n at F (D:\wamp64\www\web\vue\vuejs-essential\node_modules\which\which.js:68:19)\n at E (D:\wamp64\www\web\vue\vuejs-essential\node_modules\which\which.js:80:29)\n at D:\wamp64\www\web\vue\vuejs-essential\node_modules\which\which.js:89:16\n at D:\wamp64\www\web\vue\vuejs-essential\node_modules\isexe\index.js:42:5\n at D:\wamp64\www\web\vue\vuejs-essential\node_modules\isexe\windows.js:36:5\n at FSReqWrap.oncomplete (fs.js:152:21)',
gyp verb which failed code: 'ENOENT' }
gyp verb check python checking for Python executable "python" in the PATH
gyp verb which succeeded python D:\Anaconda\python.EXE
gyp verb check python version D:\Anaconda\python.EXE -c "import platform; print(platform.python_version());" returned: "3.6.5\r\n"
gyp verb could not find "D:\Anaconda\python.EXE". checking python launcher
gyp verb could not find "D:\Anaconda\python.EXE". guessing location
gyp verb ensuring that file exists: C:\Python27\python.exe
gyp ERR! configure error
gyp ERR! stack Error: Can't find Python executable "D:\Anaconda\python.EXE", you can set the PYTHON env variable.
gyp ERR! stack at PythonFinder.failNoPython (D:\wamp64\www\web\vue\vuejs-essential\node_modules\node-gyp\lib\configure.js:492:19)
gyp ERR! stack at PythonFinder. (D:\wamp64\www\web\vue\vuejs-essential\node_modules\node-gyp\lib\configure.js:517:16)
gyp ERR! stack at D:\wamp64\www\web\vue\vuejs-essential\node_modules\graceful-fs\polyfills.js:284:29
gyp ERR! stack at FSReqWrap.oncomplete (fs.js:152:21)
gyp ERR! System Windows_NT 10.0.17134
gyp ERR! command "D:\Program Files\nodejs\node.exe" "D:\wamp64\www\web\vue\vuejs-essential\node_modules\node-gyp\bin\node-gyp.js" "rebuild" "--verbose" "--libsass_ext=" "--libsass_cflags=" "--libsass_ldflags=" "--libsass_library="
gyp ERR! cwd D:\wamp64\www\web\vue\vuejs-essential\node_modules\node-sass
gyp ERR! node -v v8.11.2
gyp ERR! node-gyp -v v3.7.0
gyp ERR! not ok
Build failed with error code: 1
npm WARN ajv-keywords@3.2.0 requires a peer of ajv@^6.0.0 but none is installed. You must install peer dependencies yourself.
npm WARN optional SKIPPING OPTIONAL DEPENDENCY: fsevents@1.2.4 (node_modules\fsevents):
npm WARN notsup SKIPPING OPTIONAL DEPENDENCY: Unsupported platform for fsevents@1.2.4: wanted {"os":"darwin","arch":"any"} (current: {"os":"win32","arch":"x64"})

npm ERR! code ELIFECYCLE
npm ERR! errno 1
npm ERR! node-sass@4.9.0 postinstall: node scripts/build.js
npm ERR! Exit status 1
npm ERR!
npm ERR! Failed at the node-sass@4.9.0 postinstall script.
npm ERR! This is probably not a problem with npm. There is likely additional logging output above.

npm ERR! A complete log of this run can be found in:
npm ERR! C:\Users\zf186\AppData\Roaming\npm-cache_logs\2018-06-10T13_29_46_208Z-debug.log

最佳答案

可能是网络连接的问题,尝试使用下面的命令,指定 node-sass 的下载源:

> npm config set sass-binary-site http://npm.taobao.org/mirrors/node-sass
4个月前
讨论数量: 3

可能是网络连接的问题,尝试使用下面的命令,指定 node-sass 的下载源:

> npm config set sass-binary-site http://npm.taobao.org/mirrors/node-sass
4个月前

淘宝镜像已添加,执行命令还是这样的结果,不过在我坚持不懈的努力下,反复执行该命令终于成功了

4个月前
aimer

cnpm install pug sass-loader node-sass --save-dev

3个月前

  • 请注意单词拼写,以及中英文排版,参考此页
  • 支持 Markdown 格式, **粗体**、~~删除线~~、`单行代码`, 更多语法请见这里 Markdown 语法
  • 支持表情,使用方法请见 Emoji 自动补全来咯,可用的 Emoji 请见 :metal: :point_right: Emoji 列表 :star: :sparkles:
  • 上传图片, 支持拖拽和剪切板黏贴上传, 格式限制 - jpg, png, gif
  • 发布框支持本地存储功能,会在内容变更时保存,「提交」按钮点击时清空
  请勿发布不友善或者负能量的内容。与人为善,比聪明更重要!